BDBM50205667 4-(2-chlorophenyl)-7-(3-(piperidin-1-yl)propoxy)-1,2,3,4-tetrahydro-2,6-naphthyridine::CHEMBL247076
SMILES Clc1ccccc1C1CNCc2cc(OCCCN3CCCCC3)ncc12
InChI Key InChIKey=KIFGUYTXOHEXTE-UHFFFAOYSA-N
Data  3 KI
  Tab Delimited (TSV)   2D SDfile   Computed 3D by Vconf -m prep SDfile
Find this compound or compounds like it in BindingDB:
Activity Spreadsheet -- Enzyme Inhibition Constant Data from BindingDB
Found 3 hits for monomerid = 50205667
TargetHistamine H3 receptor(Homo sapiens (Human))
Johnson & Johnson Pharmaceutical Research & Development
Curated by ChEMBL
LigandPNGBDBM50205667(4-(2-chlorophenyl)-7-(3-(piperidin-1-yl)propoxy)-1...)
Affinity DataKi:  1nM. Assay description: Displacement of N-[3H]alpha-methylhistamine from human histamine H3 receptor expressed in SK-N-MC cells
In DepthDetails ArticlePubMed
TargetSodium-dependent serotonin transporter(Rattus norvegicus (rat))
Johnson & Johnson Pharmaceutical Research & Development
Curated by ChEMBL
LigandPNGBDBM50205667(4-(2-chlorophenyl)-7-(3-(piperidin-1-yl)propoxy)-1...)
Affinity DataKi:  194nM. Assay description: Binding affinity to rat SERT
In DepthDetails ArticlePubMed
TargetSodium-dependent serotonin transporter(Homo sapiens (Human))
Johnson & Johnson Pharmaceutical Research & Development
Curated by ChEMBL
LigandPNGBDBM50205667(4-(2-chlorophenyl)-7-(3-(piperidin-1-yl)propoxy)-1...)
Affinity DataKi:  1.33E+3nM. Assay description: Binding affinity to human SERT
In DepthDetails ArticlePubMed