BDBM50205672 CHEMBL3901694
SMILES COc1ccc2[nH]c3c(nccc3c2c1)-c1ccc(F)cc1
InChI Key InChIKey=AQWAZPMZAHDMOY-UHFFFAOYSA-N
Data  1 IC50
  Tab Delimited (TSV)   2D SDfile   Computed 3D by Vconf -m prep SDfile
Find this compound or compounds like it in BindingDB:
Activity Spreadsheet -- Enzyme Inhibition Constant Data from BindingDB
Found 1 hit for monomerid = 50205672
TargetCholinesterase(Homo sapiens (Human))
University Of Massachusetts Boston
Curated by ChEMBL
LigandPNGBDBM50205672(CHEMBL3901694)
Affinity DataIC50: >1.00E+4nM. Assay description: Inhibition of BuChE (unknown origin) by spectrophotometric analysis based Ellman's assay
In DepthDetails ArticlePubMed