BDBM50205674 CHEMBL1682916
SMILES O=C(c1ccccc1)c1nccc2c3ccccc3[nH]c12
InChI Key InChIKey=ZVQHFEFCMIBJJF-UHFFFAOYSA-N
Data  1 IC50
  Tab Delimited (TSV)   2D SDfile   Computed 3D by Vconf -m prep SDfile
Find this compound or compounds like it in BindingDB:
Activity Spreadsheet -- Enzyme Inhibition Constant Data from BindingDB
Found 1 hit for monomerid = 50205674
TargetCholinesterase(Homo sapiens (Human))
University Of Massachusetts Boston
Curated by ChEMBL
LigandPNGBDBM50205674(CHEMBL1682916)
Affinity DataIC50: >1.00E+4nM. Assay description: Inhibition of BuChE (unknown origin) by spectrophotometric analysis based Ellman's assay
In DepthDetails ArticlePubMed