BDBM50205688 CHEMBL3975325
SMILES c1ccc(cc1)-c1nccc2c3ccccc3[nH]c12
InChI Key InChIKey=WOHXZRIXRLZSBI-UHFFFAOYSA-N
Data  2 KI  2 IC50
  Tab Delimited (TSV)   2D SDfile   Computed 3D by Vconf -m prep SDfile
Find this compound or compounds like it in BindingDB:
Activity Spreadsheet -- Enzyme Inhibition Constant Data from BindingDB
Found 4 hits for monomerid = 50205688
Target5-hydroxytryptamine receptor 5A(Homo sapiens (Human))TBA
LigandPNGBDBM50205688(CHEMBL3975325)
Affinity DataKi:  1.40E+3nM. Assay description: Binding affinity to 5-HT5AR (unknown origin) assessed as inhibition constant
In DepthDetails PubMed
Target5-hydroxytryptamine receptor 2B(Homo sapiens (Human))TBA
LigandPNGBDBM50205688(CHEMBL3975325)
Affinity DataKi:  1.40E+3nM. Assay description: Binding affinity to 5-HT2BR (unknown origin) assessed as inhibition constant
In DepthDetails PubMed
TargetCholinesterase(Homo sapiens (Human))
University Of Massachusetts Boston
Curated by ChEMBL
LigandPNGBDBM50205688(CHEMBL3975325)
Affinity DataIC50: >1.00E+4nM. Assay description: Inhibition of BuChE (unknown origin) by spectrophotometric analysis based Ellman's assay
In DepthDetails ArticlePubMed
TargetTryptophan 2,3-dioxygenase(Homo sapiens (Human))
Nanjing Medical University
Curated by ChEMBL
LigandPNGBDBM50205688(CHEMBL3975325)
Affinity DataIC50:  7.24E+3nM. Assay description: Inhibition of TDO (unknown origin) assessed as reduction in N-formylkynurenine formation using L-tryptophan as substrate incubated for 75 mins by UV ...
In DepthDetails PubMed