BDBM50206359 CHEMBL3945341
SMILES [H][C@]1(OC(=C[C@H](NC(=N)NC(=O)Cn2cc(nn2)-c2cccc(c2)C(=O)OCC)[C@H]1NC(C)=O)C(O)=O)[C@H](O)[C@H](O)CO
InChI Key InChIKey=CBTRKZBQJJGMEX-KDAIUHROSA-N
Data  1 IC50
  Tab Delimited (TSV)   2D SDfile   Computed 3D by Vconf -m prep SDfile
Find this compound or compounds like it in BindingDB:
Activity Spreadsheet -- Enzyme Inhibition Constant Data from BindingDB
Found 1 hit for monomerid = 50206359
TargetNeuraminidase(Influenza A virus (strain A/Wilson-Smith/1933 H1N1...)
National Tsing Hua University
Curated by ChEMBL
LigandPNGBDBM50206359(CHEMBL3945341)
Affinity DataIC50:  13nM. Assay description: Inhibition of MDCK infected Influenza A virus A/WSN/33(H1N1) neuraminidase using MU-NANA as substrate preincubated for 30 mins followed by substrate ...
In DepthDetails ArticlePubMed