BDBM50206757 CHEMBL3921860
SMILES COc1ccc(Br)c(CC2CCN(CCc3cccc4OCCOc34)CC2)c1
InChI Key InChIKey=SWUDFVPQPPJCID-UHFFFAOYSA-N
Data  2 KI
  Tab Delimited (TSV)   2D SDfile   Computed 3D by Vconf -m prep SDfile
Find this compound or compounds like it in BindingDB:
Activity Spreadsheet -- Enzyme Inhibition Constant Data from BindingDB
Found 2 hits for monomerid = 50206757
Target5-hydroxytryptamine receptor 1A(Homo sapiens (Human))
Sumitomo Dainippon Pharma
Curated by ChEMBL
LigandPNGBDBM50206757(CHEMBL3921860)
Affinity DataKi:  2.10nM. Assay description: Displacement of [3H]-8-OH-DPAT from human 5-HT1A receptor expressed in CHOK1 cells after 30 mins by liquid scintillation counting analysis
In DepthDetails ArticlePubMed
TargetSodium-dependent serotonin transporter(Homo sapiens (Human))
Sumitomo Dainippon Pharma
Curated by ChEMBL
LigandPNGBDBM50206757(CHEMBL3921860)
Affinity DataKi:  26nM. Assay description: Inhibition of human SERT expressed in CHO cell membranes assessed as reduction in [3H]serotonin uptake preincubated for 10 mins followed by [3H]serot...
In DepthDetails ArticlePubMed