BDBM50206774 CHEMBL3924225
SMILES COc1ccc(Br)c(CC2CCN(CCc3ccccc3OC)CC2)c1
InChI Key InChIKey=JBUHYCVPTFVUQE-UHFFFAOYSA-N
Data  2 KI
  Tab Delimited (TSV)   2D SDfile   Computed 3D by Vconf -m prep SDfile
Find this compound or compounds like it in BindingDB:
Activity Spreadsheet -- Enzyme Inhibition Constant Data from BindingDB
Found 2 hits for monomerid = 50206774
Target5-hydroxytryptamine receptor 1A(Homo sapiens (Human))
Sumitomo Dainippon Pharma
Curated by ChEMBL
LigandPNGBDBM50206774(CHEMBL3924225)
Affinity DataKi:  3nM. Assay description: Displacement of [3H]-8-OH-DPAT from human 5-HT1A receptor expressed in CHOK1 cells after 30 mins by liquid scintillation counting analysis
In DepthDetails ArticlePubMed
TargetSodium-dependent serotonin transporter(Homo sapiens (Human))
Sumitomo Dainippon Pharma
Curated by ChEMBL
LigandPNGBDBM50206774(CHEMBL3924225)
Affinity DataKi:  38nM. Assay description: Inhibition of human SERT expressed in CHO cell membranes assessed as reduction in [3H]serotonin uptake preincubated for 10 mins followed by [3H]serot...
In DepthDetails ArticlePubMed