BDBM50206916 (+/-)-2,3-O-di[4-(4,5-dihydro-5-oxo-4H-1,2,4-oxadiazol-3-yl)methylphenyl]-1-O-tetradecylglycerol::CHEMBL222723
SMILES CCCCCCCCCCCCCCOCC(COc1ccc(Cc2nc(=O)o[nH]2)cc1)Oc1ccc(Cc2nc(=O)o[nH]2)cc1
InChI Key InChIKey=WRKXDMWMLRJIPF-UHFFFAOYSA-N
Data  2 IC50
  Tab Delimited (TSV)   2D SDfile   Computed 3D by Vconf -m prep SDfile
Find this compound or compounds like it in BindingDB:
Activity Spreadsheet -- Enzyme Inhibition Constant Data from BindingDB
Found 2 hits for monomerid = 50206916
TargetPhospholipase A2, major isoenzyme(Sus scrofa (pig))
Université
Curated by ChEMBL
LigandPNGBDBM50206916((+/-)-2,3-O-di[4-(4,5-dihydro-5-oxo-4H-1,2,4-oxadi...)
Affinity DataIC50:  5.78E+4nM. Assay description: Inhibition of pig group IB PLA2 by fluorimetric assay
In DepthDetails ArticlePubMed
TargetPhospholipase A2, membrane associated(Homo sapiens (Human))
Université
Curated by ChEMBL
LigandPNGBDBM50206916((+/-)-2,3-O-di[4-(4,5-dihydro-5-oxo-4H-1,2,4-oxadi...)
Affinity DataIC50:  3.10E+3nM. Assay description: Inhibition of human group IIA PLA2 by fluorimetric assay
In DepthDetails ArticlePubMed