BDBM50207651 CHEMBL3934736
SMILES COc1cccc(CN([C@@H](C(N)=O)c2ccccc2)C(=O)c2ccccc2)c1
InChI Key InChIKey=NACPFAKKSBPVRT-OAQYLSRUSA-N
Data  1 IC50
  Tab Delimited (TSV)   2D SDfile   Computed 3D by Vconf -m prep SDfile
Find this compound or compounds like it in BindingDB:
Activity Spreadsheet -- Enzyme Inhibition Constant Data from BindingDB
Found 1 hit for monomerid = 50207651
TargetTransient receptor potential cation channel subfamily M member 8(Homo sapiens (Human))
Kissei Pharmaceutical
Curated by ChEMBL
LigandPNGBDBM50207651(CHEMBL3934736)
Affinity DataIC50:  900nM. Assay description: Antagonist activity at human recombinant TRPM8 expressed in HEK293 cells assessed as inhibition of menthol-induced calcium increase by Fluo-4 AM base...
In DepthDetails ArticlePubMed