BDBM50207664 CHEMBL3935896
SMILES C[C@@H](N([C@@H](C(N)=O)c1ccccc1)C(=O)c1cccc(C)c1)c1cccc(Cl)c1
InChI Key InChIKey=WEBXAAQZTQETAN-VGOFRKELSA-N
Data  1 IC50
  Tab Delimited (TSV)   2D SDfile   Computed 3D by Vconf -m prep SDfile
Find this compound or compounds like it in BindingDB:
Activity Spreadsheet -- Enzyme Inhibition Constant Data from BindingDB
Found 1 hit for monomerid = 50207664
TargetTransient receptor potential cation channel subfamily M member 8(Homo sapiens (Human))
Kissei Pharmaceutical
Curated by ChEMBL
LigandPNGBDBM50207664(CHEMBL3935896)
Affinity DataIC50:  2.10E+3nM. Assay description: Antagonist activity at human recombinant TRPM8 expressed in HEK293 cells assessed as inhibition of menthol-induced calcium increase by Fluo-4 AM base...
In DepthDetails ArticlePubMed