BDBM50207668 CHEMBL3908765
SMILES NC(=O)[C@H](N(Cc1ccccc1Cl)C(=O)c1ccccc1)c1ccccc1
InChI Key InChIKey=XOCUQKNJEGWLLD-HXUWFJFHSA-N
Data  1 IC50
  Tab Delimited (TSV)   2D SDfile   Computed 3D by Vconf -m prep SDfile
Find this compound or compounds like it in BindingDB:
Activity Spreadsheet -- Enzyme Inhibition Constant Data from BindingDB
Found 1 hit for monomerid = 50207668
TargetTransient receptor potential cation channel subfamily M member 8(Homo sapiens (Human))
Kissei Pharmaceutical
Curated by ChEMBL
LigandPNGBDBM50207668(CHEMBL3908765)
Affinity DataIC50:  5.60E+3nM. Assay description: Antagonist activity at human recombinant TRPM8 expressed in HEK293 cells assessed as inhibition of menthol-induced calcium increase by Fluo-4 AM base...
In DepthDetails ArticlePubMed