BDBM50207688 CHEMBL3916922
SMILES C[C@@H](N([C@@H](C(N)=O)c1ccccc1)C(=O)c1ccc(C)cc1)c1cccc(Cl)c1
InChI Key InChIKey=KYASWEHGQISFSF-VGOFRKELSA-N
Data  1 IC50
  Tab Delimited (TSV)   2D SDfile   Computed 3D by Vconf -m prep SDfile
Find this compound or compounds like it in BindingDB:
Activity Spreadsheet -- Enzyme Inhibition Constant Data from BindingDB
Found 1 hit for monomerid = 50207688
TargetTransient receptor potential cation channel subfamily M member 8(Homo sapiens (Human))
Kissei Pharmaceutical
Curated by ChEMBL
LigandPNGBDBM50207688(CHEMBL3916922)
Affinity DataIC50:  850nM. Assay description: Antagonist activity at human recombinant TRPM8 expressed in HEK293 cells assessed as inhibition of menthol-induced calcium increase by Fluo-4 AM base...
In DepthDetails ArticlePubMed