BDBM50209251 (S)-N-(1-(2-aminophenethyl)piperidin-4-yl)-1-(5-chloronaphthalen-2-ylsulfonyl)-N-methylpyrrolidine-2-carboxamide::CHEMBL395680
SMILES CN(C1CCN(CCc2ccccc2N)CC1)C(=O)[C@@H]1CCCN1S(=O)(=O)c1ccc2c(Cl)cccc2c1
InChI Key InChIKey=LKYBJMRQBVFXGN-NDEPHWFRSA-N
Data  1 KI
  Tab Delimited (TSV)   2D SDfile   Computed 3D by Vconf -m prep SDfile
Find this compound or compounds like it in BindingDB:
Activity Spreadsheet -- Enzyme Inhibition Constant Data from BindingDB
Found 1 hit for monomerid = 50209251
TargetC-C chemokine receptor type 4(Homo sapiens (Human))
Millennium Pharmaceuticals
Curated by ChEMBL
LigandPNGBDBM50209251((S)-N-(1-(2-aminophenethyl)piperidin-4-yl)-1-(5-ch...)
Affinity DataKi:  280nM. Assay description: Displacement of human TARC from recombinant CCR4 receptor expressed in CHO cells coexpressing Galpha16 by FLIPR assay
In DepthDetails ArticlePubMed