BDBM50209495 3-{2-[bis-(4-fluorophenyl)methoxy]ethyl}-6-[(1Hinden-2-yl)methyl]-3,6-diazabicyclo [3.1.1]heptane fumarate
SMILES Fc1ccc(cc1)C(OCCN1CC2CC(C1)N2CC1=Cc2ccccc2C1)c1ccc(F)cc1
InChI Key InChIKey=WKDAQRUVSXQQEE-UHFFFAOYSA-N
Data  1 KI
  Tab Delimited (TSV)   2D SDfile   Computed 3D by Vconf -m prep SDfile
Find this compound or compounds like it in BindingDB:
Activity Spreadsheet -- Enzyme Inhibition Constant Data from BindingDB
Found 1 hit for monomerid = 50209495
TargetSodium-dependent dopamine transporter(Rattus norvegicus (rat))
Universit£
Curated by ChEMBL
LigandPNGBDBM50209495(3-{2-[bis-(4-fluorophenyl)methoxy]ethyl}-6-[(1Hind...)
Affinity DataKi:  6.5nM. Assay description: Inhibition of [3H]dopamine uptake at DAT in Sprague-Dawley rat striatum synaptosome
Ligand InfoPC cidPC sid
In DepthDetails ArticlePubMed