BDBM50209551 2-[3-cyano-2-(2'-ethoxy-biphenyl-4-yl)-6-fluoro-quinolin-4-ylamino]-propionic acid::CHEMBL246798
SMILES CCOc1ccccc1-c1ccc(cc1)-c1nc2ccc(F)cc2c(NC(C)C(O)=O)c1C#N
InChI Key InChIKey=SXFYSRMCZRZBKE-UHFFFAOYSA-N
Data  1 IC50
  Tab Delimited (TSV)   2D SDfile   Computed 3D by Vconf -m prep SDfile
Find this compound or compounds like it in BindingDB:
Activity Spreadsheet -- Enzyme Inhibition Constant Data from BindingDB
Found 1 hit for monomerid = 50209551
TargetcAMP and cAMP-inhibited cGMP 3',5'-cyclic phosphodiesterase 10A(Homo sapiens (Human))
Bayer Pharmaceuticals
Curated by ChEMBL
LigandPNGBDBM50209551(2-[3-cyano-2-(2'-ethoxy-biphenyl-4-yl)-6-fluoro-qu...)
Affinity DataIC50:  6nM. Assay description: Inhibition of human recombinant PDE10A transfected in insect Sf9 cells by scintillation proximity assay
In DepthDetails ArticlePubMed