BDBM50210589 CHEMBL247130::N-(4-chlorobenzyl)-2-(morpholinomethyl)-4-oxo-4,7-dihydrothieno[2,3-b]pyridine-5-carboxamide
SMILES Oc1c(cnc2sc(CN3CCOCC3)cc12)C(=O)NCc1ccc(Cl)cc1
InChI Key InChIKey=CFKIMGPJOCQJHM-UHFFFAOYSA-N
Data  1 IC50
  Tab Delimited (TSV)   2D SDfile   Computed 3D by Vconf -m prep SDfile
Find this compound or compounds like it in BindingDB:
Activity Spreadsheet -- Enzyme Inhibition Constant Data from BindingDB
Found 1 hit for monomerid = 50210589
TargetDNA polymerase catalytic subunit(Human cytomegalovirus (HCMV strain AD169) )
Pfizer
Curated by ChEMBL
LigandPNGBDBM50210589(CHEMBL247130 | N-(4-chlorobenzyl)-2-(morpholinomet...)
Affinity DataIC50:  1.10E+3nM. Assay description: Inhibition of HCMV DNA polymerase by scintillation proximity assay
In DepthDetails ArticlePubMed