BDBM50210621 CHEMBL395390::N-(4-chlorobenzyl)-2-(((2-(furan-3-yl)-2-hydroxyethyl)(methyl)amino)methyl)-7-methyl-4-oxo-4,7-dihydrothieno[2,3-b]pyridine-5-carboxamide
SMILES CN(CC(O)c1ccoc1)Cc1cc2c(s1)n(C)cc(C(=O)NCc1ccc(Cl)cc1)c2=O
InChI Key InChIKey=WKTVTQHFAIYTTK-UHFFFAOYSA-N
Data  1 IC50
  Tab Delimited (TSV)   2D SDfile   Computed 3D by Vconf -m prep SDfile
Find this compound or compounds like it in BindingDB:
Activity Spreadsheet -- Enzyme Inhibition Constant Data from BindingDB
Found 1 hit for monomerid = 50210621
TargetDNA polymerase catalytic subunit(Human cytomegalovirus (HCMV strain AD169) )
Pfizer
Curated by ChEMBL
LigandPNGBDBM50210621(CHEMBL395390 | N-(4-chlorobenzyl)-2-(((2-(furan-3-...)
Affinity DataIC50:  250nM. Assay description: Inhibition of HCMV DNA polymerase by scintillation proximity assay
In DepthDetails ArticlePubMed