BDBM50211293 CHEMBL3896675
SMILES CC(C)c1ccc(C)cc1OC(=O)Nc1ccc(cc1)[N+]([O-])=O
InChI Key InChIKey=XSAOEMAEMWUWPW-UHFFFAOYSA-N
Data  2 IC50
  Tab Delimited (TSV)   2D SDfile   Computed 3D by Vconf -m prep SDfile
Find this compound or compounds like it in BindingDB:
Activity Spreadsheet -- Enzyme Inhibition Constant Data from BindingDB
Found 2 hits for monomerid = 50211293
TargetCholinesterase(Equus caballus (Horse))
Bezmialem Vakif University
Curated by ChEMBL
LigandPNGBDBM50211293(CHEMBL3896675)
Affinity DataIC50:  3.77E+4nM. Assay description: Inhibition of horse serum BuChE using butyrylthiocholine iodide as substrate preincubated for 15 mins followed by substrate addition by Ellman's meth...
In DepthDetails ArticlePubMed
TargetAcetylcholinesterase(Electrophorus electricus (Electric eel))
Bezmialem Vakif University
Curated by ChEMBL
LigandPNGBDBM50211293(CHEMBL3896675)
Affinity DataIC50:  2.50E+3nM. Assay description: Inhibition of electric eel AChE using acetylthiocholine iodide as substrate preincubated for 15 mins followed by substrate addition by Ellman's metho...
In DepthDetails ArticlePubMed