BDBM50211367 Ac-Nle4-cyclo(Asp5-His6-D-Phe(4-Cl)-Pro8-Trp9-Lys10)-NH2::CHEMBL376339
SMILES CCCC[C@H](NC(C)=O)C(=O)N[C@H]1CC(=O)NCCCC[C@H](NC(=O)[C@H](Cc2cc3ccccc3[nH]2)NC(=O)[C@@H]2CCCN2C(=O)[C@@H](Cc2ccc(Cl)cc2)NC(=O)[C@H](Cc2cnc[nH]2)NC1=O)C(N)=O
InChI Key InChIKey=HROUSAHWAGUIEV-CQPWUTEUSA-N
Data  4 IC50  3 EC50
  Tab Delimited (TSV)   2D SDfile   Computed 3D by Vconf -m prep SDfile
Find this compound or compounds like it in BindingDB:
Activity Spreadsheet -- Enzyme Inhibition Constant Data from BindingDB
Found 7 hits for monomerid = 50211367
TargetMelanocortin receptor 3(Homo sapiens (Human))
Merck Research Laboratories
Curated by ChEMBL
LigandPNGBDBM50211367(Ac-Nle4-cyclo(Asp5-His6-D-Phe(4-Cl)-Pro8-Trp9-Lys1...)
Affinity DataIC50: >2.00E+4nM. Assay description: Displacement of [125I]NDPalphaMSH from human cloned MC3R expressed in CHO cells
In DepthDetails ArticlePubMed
TargetMelanocortin receptor 5(Homo sapiens (Human))
Merck Research Laboratories
Curated by ChEMBL
LigandPNGBDBM50211367(Ac-Nle4-cyclo(Asp5-His6-D-Phe(4-Cl)-Pro8-Trp9-Lys1...)
Affinity DataEC50:  82nM. Assay description: Agonist activity at human MC5R expressed in CHO cells assessed as cAMP accumulation
In DepthDetails ArticlePubMed
TargetMelanocortin receptor 3(Homo sapiens (Human))
Merck Research Laboratories
Curated by ChEMBL
LigandPNGBDBM50211367(Ac-Nle4-cyclo(Asp5-His6-D-Phe(4-Cl)-Pro8-Trp9-Lys1...)
Affinity DataEC50: >5.00E+3nM. Assay description: Agonist activity at human MC3R expressed in CHO cells assessed as cAMP accumulation
In DepthDetails ArticlePubMed
TargetMelanocortin receptor 4(Homo sapiens (Human))
Merck Research Laboratories
Curated by ChEMBL
LigandPNGBDBM50211367(Ac-Nle4-cyclo(Asp5-His6-D-Phe(4-Cl)-Pro8-Trp9-Lys1...)
Affinity DataIC50:  4.50E+3nM. Assay description: Displacement of [125I]NDPalphaMSH from human cloned MC4R expressed in CHO cells
In DepthDetails ArticlePubMed
TargetMelanocyte-stimulating hormone receptor(Homo sapiens (Human))
Merck Research Laboratories
Curated by ChEMBL
LigandPNGBDBM50211367(Ac-Nle4-cyclo(Asp5-His6-D-Phe(4-Cl)-Pro8-Trp9-Lys1...)
Affinity DataEC50:  63nM. Assay description: Agonist activity at human melanocortin receptor 1b expressed in CHO cells assessed as cAMP accumulation
In DepthDetails ArticlePubMed
TargetMelanocortin receptor 5(Homo sapiens (Human))
Merck Research Laboratories
Curated by ChEMBL
LigandPNGBDBM50211367(Ac-Nle4-cyclo(Asp5-His6-D-Phe(4-Cl)-Pro8-Trp9-Lys1...)
Affinity DataIC50:  1.30E+3nM. Assay description: Displacement of [125I]NDPalphaMSH from human cloned MC5R expressed in CHO cells
In DepthDetails ArticlePubMed
TargetMelanocyte-stimulating hormone receptor(Homo sapiens (Human))
Merck Research Laboratories
Curated by ChEMBL
LigandPNGBDBM50211367(Ac-Nle4-cyclo(Asp5-His6-D-Phe(4-Cl)-Pro8-Trp9-Lys1...)
Affinity DataIC50:  560nM. Assay description: Displacement of [125I]NDPalphaMSH from human cloned melanocortin receptor 1b expressed in CHO cells
In DepthDetails ArticlePubMed