BDBM50211370 Ac-Nle4-cyclo(Asp5-Oic6-D-D-pBzlPhe7-Pip8-Trp9-Lys10)-NH2::CHEMBL2371973
SMILES [H][C@@]12CC3CCCCC3N1C(=O)[C@H](CC(=O)NCCCC[C@H](NC(=O)[C@H](Cc1c[nH]c3ccccc13)NC(=O)[C@]1([H])CCCCN1C(=O)[C@H](Cc1ccc(Cc3ccccc3)cc1)NC2=O)C(N)=O)NC(=O)[C@H](CCCC)NC(C)=O
InChI Key InChIKey=VSEDHYYTUINXNF-LNBUPULLSA-N
Data  4 IC50  1 EC50
  Tab Delimited (TSV)   2D SDfile   Computed 3D by Vconf -m prep SDfile
Find this compound or compounds like it in BindingDB:
Activity Spreadsheet -- Enzyme Inhibition Constant Data from BindingDB
Found 5 hits for monomerid = 50211370
TargetMelanocortin receptor 5(Homo sapiens (Human))
Merck Research Laboratories
Curated by ChEMBL
LigandPNGBDBM50211370(Ac-Nle4-cyclo(Asp5-Oic6-D-D-pBzlPhe7-Pip8-Trp9-Lys...)
Affinity DataEC50:  31nM. Assay description: Agonist activity at human MC5R expressed in CHO cells assessed as cAMP accumulation
In DepthDetails ArticlePubMed
TargetMelanocortin receptor 3(Homo sapiens (Human))
Merck Research Laboratories
Curated by ChEMBL
LigandPNGBDBM50211370(Ac-Nle4-cyclo(Asp5-Oic6-D-D-pBzlPhe7-Pip8-Trp9-Lys...)
Affinity DataIC50: >1.00E+3nM. Assay description: Displacement of [125I]NDPalphaMSH from human cloned MC3R expressed in CHO cells
In DepthDetails ArticlePubMed
TargetMelanocyte-stimulating hormone receptor(Homo sapiens (Human))
Merck Research Laboratories
Curated by ChEMBL
LigandPNGBDBM50211370(Ac-Nle4-cyclo(Asp5-Oic6-D-D-pBzlPhe7-Pip8-Trp9-Lys...)
Affinity DataIC50: >1.00E+3nM. Assay description: Displacement of [125I]NDPalphaMSH from human cloned melanocortin receptor 1b expressed in CHO cells
In DepthDetails ArticlePubMed
TargetMelanocortin receptor 4(Homo sapiens (Human))
Merck Research Laboratories
Curated by ChEMBL
LigandPNGBDBM50211370(Ac-Nle4-cyclo(Asp5-Oic6-D-D-pBzlPhe7-Pip8-Trp9-Lys...)
Affinity DataIC50:  1.60E+3nM. Assay description: Displacement of [125I]NDPalphaMSH from human cloned MC4R expressed in CHO cells
In DepthDetails ArticlePubMed
TargetMelanocortin receptor 5(Homo sapiens (Human))
Merck Research Laboratories
Curated by ChEMBL
LigandPNGBDBM50211370(Ac-Nle4-cyclo(Asp5-Oic6-D-D-pBzlPhe7-Pip8-Trp9-Lys...)
Affinity DataIC50:  24nM. Assay description: Displacement of [125I]NDPalphaMSH from human cloned MC5R expressed in CHO cells
In DepthDetails ArticlePubMed