BDBM50211380 Ac-Nle4-cyclo(Asp5-His6-D-Nal(2)-Pro8-Trp9-Lys10)-NH2::CHEMBL438294
SMILES CCCC[C@H](NC(C)=O)C(=O)N[C@H]1CC(=O)NCCCC[C@H](NC(=O)[C@H](Cc2cc3ccccc3[nH]2)NC(=O)[C@@H]2CCCN2C(=O)[C@@H](Cc2ccc3ccccc3c2)NC(=O)[C@H](Cc2cnc[nH]2)NC1=O)C(N)=O
InChI Key InChIKey=ZWUGIRDPPFGGRP-GTBIJRGCSA-N
Data  4 IC50  2 EC50
  Tab Delimited (TSV)   2D SDfile   Computed 3D by Vconf -m prep SDfile
Find this compound or compounds like it in BindingDB:
Activity Spreadsheet -- Enzyme Inhibition Constant Data from BindingDB
Found 6 hits for monomerid = 50211380
TargetMelanocortin receptor 3(Homo sapiens (Human))
Merck Research Laboratories
Curated by ChEMBL
LigandPNGBDBM50211380(Ac-Nle4-cyclo(Asp5-His6-D-Nal(2)-Pro8-Trp9-Lys10)-...)
Affinity DataIC50: >1.00E+4nM. Assay description: Displacement of [125I]NDPalphaMSH from human cloned MC3R expressed in CHO cells
In DepthDetails ArticlePubMed
TargetMelanocortin receptor 5(Homo sapiens (Human))
Merck Research Laboratories
Curated by ChEMBL
LigandPNGBDBM50211380(Ac-Nle4-cyclo(Asp5-His6-D-Nal(2)-Pro8-Trp9-Lys10)-...)
Affinity DataIC50:  50nM. Assay description: Displacement of [125I]NDPalphaMSH from human cloned MC5R expressed in CHO cells
In DepthDetails ArticlePubMed
TargetMelanocortin receptor 4(Homo sapiens (Human))
Merck Research Laboratories
Curated by ChEMBL
LigandPNGBDBM50211380(Ac-Nle4-cyclo(Asp5-His6-D-Nal(2)-Pro8-Trp9-Lys10)-...)
Affinity DataIC50:  4.80E+3nM. Assay description: Displacement of [125I]NDPalphaMSH from human cloned MC4R expressed in CHO cells
In DepthDetails ArticlePubMed
TargetMelanocortin receptor 5(Homo sapiens (Human))
Merck Research Laboratories
Curated by ChEMBL
LigandPNGBDBM50211380(Ac-Nle4-cyclo(Asp5-His6-D-Nal(2)-Pro8-Trp9-Lys10)-...)
Affinity DataEC50:  50nM. Assay description: Agonist activity at human MC5R expressed in CHO cells assessed as cAMP accumulation
In DepthDetails ArticlePubMed
TargetMelanocyte-stimulating hormone receptor(Homo sapiens (Human))
Merck Research Laboratories
Curated by ChEMBL
LigandPNGBDBM50211380(Ac-Nle4-cyclo(Asp5-His6-D-Nal(2)-Pro8-Trp9-Lys10)-...)
Affinity DataEC50:  89nM. Assay description: Agonist activity at human melanocortin receptor 1b expressed in CHO cells assessed as cAMP accumulation
In DepthDetails ArticlePubMed
TargetMelanocyte-stimulating hormone receptor(Homo sapiens (Human))
Merck Research Laboratories
Curated by ChEMBL
LigandPNGBDBM50211380(Ac-Nle4-cyclo(Asp5-His6-D-Nal(2)-Pro8-Trp9-Lys10)-...)
Affinity DataIC50:  880nM. Assay description: Displacement of [125I]NDPalphaMSH from human cloned melanocortin receptor 1b expressed in CHO cells
In DepthDetails ArticlePubMed