BDBM50211402 CHEMBL3897305
SMILES CC(C)c1ccc(C)c(OC(=O)NCc2ccccc2)c1
InChI Key InChIKey=CPMMNSMBFUQAAW-UHFFFAOYSA-N
Data  2 IC50
  Tab Delimited (TSV)   2D SDfile   Computed 3D by Vconf -m prep SDfile
Find this compound or compounds like it in BindingDB:
Activity Spreadsheet -- Enzyme Inhibition Constant Data from BindingDB
Found 2 hits for monomerid = 50211402
TargetAcetylcholinesterase(Electrophorus electricus (Electric eel))
Bezmialem Vakif University
Curated by ChEMBL
LigandPNGBDBM50211402(CHEMBL3897305)
Affinity DataIC50:  7.78E+4nM. Assay description: Inhibition of electric eel AChE using acetylthiocholine iodide as substrate preincubated for 15 mins followed by substrate addition by Ellman's metho...
In DepthDetails ArticlePubMed
TargetCholinesterase(Equus caballus (Horse))
Bezmialem Vakif University
Curated by ChEMBL
LigandPNGBDBM50211402(CHEMBL3897305)
Affinity DataIC50:  70nM. Assay description: Inhibition of horse serum BuChE using butyrylthiocholine iodide as substrate preincubated for 15 mins followed by substrate addition by Ellman's meth...
In DepthDetails ArticlePubMed