BDBM50211409 CHEMBL3984420
SMILES CC(C)c1ccc(C)cc1OC(=O)Nc1ccc(I)cc1
InChI Key InChIKey=XIGCZRSDBZZJEX-UHFFFAOYSA-N
Data  2 IC50
  Tab Delimited (TSV)   2D SDfile   Computed 3D by Vconf -m prep SDfile
Find this compound or compounds like it in BindingDB:
Activity Spreadsheet -- Enzyme Inhibition Constant Data from BindingDB
Found 2 hits for monomerid = 50211409
TargetCholinesterase(Equus caballus (Horse))
Bezmialem Vakif University
Curated by ChEMBL
LigandPNGBDBM50211409(CHEMBL3984420)
Affinity DataIC50:  4.77E+3nM. Assay description: Inhibition of horse serum BuChE using butyrylthiocholine iodide as substrate preincubated for 15 mins followed by substrate addition by Ellman's meth...
In DepthDetails ArticlePubMed
TargetAcetylcholinesterase(Electrophorus electricus (Electric eel))
Bezmialem Vakif University
Curated by ChEMBL
LigandPNGBDBM50211409(CHEMBL3984420)
Affinity DataIC50:  3.16E+4nM. Assay description: Inhibition of electric eel AChE using acetylthiocholine iodide as substrate preincubated for 15 mins followed by substrate addition by Ellman's metho...
In DepthDetails ArticlePubMed