BDBM50211421 CHEMBL3975861
SMILES CC(C)c1ccc(C)cc1OC(=O)NCC1CCCCC1
InChI Key InChIKey=DMBUGRDCMNPOIM-UHFFFAOYSA-N
Data  1 IC50
  Tab Delimited (TSV)   2D SDfile   Computed 3D by Vconf -m prep SDfile
Find this compound or compounds like it in BindingDB:
Activity Spreadsheet -- Enzyme Inhibition Constant Data from BindingDB
Found 1 hit for monomerid = 50211421
TargetCholinesterase(Equus caballus (Horse))
Bezmialem Vakif University
Curated by ChEMBL
LigandPNGBDBM50211421(CHEMBL3975861)
Affinity DataIC50:  3.68E+4nM. Assay description: Inhibition of horse serum BuChE using butyrylthiocholine iodide as substrate preincubated for 15 mins followed by substrate addition by Ellman's meth...
In DepthDetails ArticlePubMed