BDBM50212069 CHEMBL3912967
SMILES COc1cc(OC)cc(c1)\N=C\c1cc(OC)c(OC)c(OC)c1
InChI Key InChIKey=JMMLNWTXWWEMPV-YBFXNURJSA-N
Data  1 KI  2 IC50
  Tab Delimited (TSV)   2D SDfile   Computed 3D by Vconf -m prep SDfile
Find this compound or compounds like it in BindingDB:
Activity Spreadsheet -- Enzyme Inhibition Constant Data from BindingDB
Found 3 hits for monomerid = 50212069
TargetAcetylcholinesterase(Electrophorus electricus (Electric eel))
Indian Institute Of Technology (Banaras Hindu University)
Curated by ChEMBL
LigandPNGBDBM50212069(CHEMBL3912967)
Affinity DataKi:  720nM. Assay description: Uncompetitive inhibition of electric eel AChE using varying levels of acetylthiocholine iodide substrate preincubated for 20 mins followed by substra...
In DepthDetails ArticlePubMed
TargetCholinesterase(Equus caballus (Horse))
Indian Institute Of Technology (Banaras Hindu University)
Curated by ChEMBL
LigandPNGBDBM50212069(CHEMBL3912967)
Affinity DataIC50:  3.28E+5nM. Assay description: Inhibition of horse serum BuChE using butyrylthiocholine iodide as substrate preincubated for 20 mins followed by substrate addition by Ellman's meth...
In DepthDetails ArticlePubMed
TargetAcetylcholinesterase(Electrophorus electricus (Electric eel))
Indian Institute Of Technology (Banaras Hindu University)
Curated by ChEMBL
LigandPNGBDBM50212069(CHEMBL3912967)
Affinity DataIC50:  820nM. Assay description: Inhibition of electric eel AChE using acetylthiocholine iodide as substrate preincubated for 20 mins followed by substrate addition by Ellman's metho...
In DepthDetails ArticlePubMed