BDBM50212375 CHEMBL536103
SMILES Cl.Cl.COc1ccc(cc1CN[C@H]1CCCN[C@H]1c1ccccc1)-n1nnnc1C
InChI Key InChIKey=GTHSKHKTJREEGB-ANXDEKAJSA-N
Data  1 KI
  Tab Delimited (TSV)   2D SDfile   Computed 3D by Vconf -m prep SDfile
Find this compound or compounds like it in BindingDB:
Activity Spreadsheet -- Enzyme Inhibition Constant Data from BindingDB
Found 1 hit for monomerid = 50212375
TargetSubstance-P receptor(Homo sapiens (Human))TBA
LigandPNGBDBM50212375(CHEMBL536103)
Affinity DataKi:  0.0501nM. Assay description: Inhibition of [3H]-substance P binding to human NK1 receptor expressed in chinese hamster ovary cells
In DepthDetails