BDBM50212551 1-(4-nitrophenyl)-2-(phenylsulfonyl)ethanone::CHEMBL393284
SMILES [O-][N+](=O)c1ccc(cc1)C(=O)CS(=O)(=O)c1ccccc1
InChI Key InChIKey=GBLYERGOMLTORH-UHFFFAOYSA-N
Data  1 IC50
  Tab Delimited (TSV)   2D SDfile   Computed 3D by Vconf -m prep SDfile
Find this compound or compounds like it in BindingDB:
Activity Spreadsheet -- Enzyme Inhibition Constant Data from BindingDB
Found 1 hit for monomerid = 50212551
Target11-beta-hydroxysteroid dehydrogenase 1(Homo sapiens (Human))
Wyeth Research
Curated by ChEMBL
LigandPNGBDBM50212551(1-(4-nitrophenyl)-2-(phenylsulfonyl)ethanone | CHE...)
Affinity DataIC50:  1.31E+3nM. Assay description: Inhibition of human 11beta-HSD1 expressed in CHO cells
In DepthDetails ArticlePubMed