BDBM50213140 4'-amino-4-(1,1-dimethyl-heptyl)-biphenyl-2-ol::CHEMBL391136
SMILES CCCCCCC(C)(C)c1ccc(c(O)c1)-c1ccc(N)cc1
InChI Key InChIKey=SDBAMIYHTMYHHO-UHFFFAOYSA-N
Data  2 KI
  Tab Delimited (TSV)   2D SDfile   Computed 3D by Vconf -m prep SDfile
Find this compound or compounds like it in BindingDB:
Activity Spreadsheet -- Enzyme Inhibition Constant Data from BindingDB
Found 2 hits for monomerid = 50213140
TargetCannabinoid receptor 1(Homo sapiens (Human))
Adolor
Curated by ChEMBL
LigandPNGBDBM50213140(4'-amino-4-(1,1-dimethyl-heptyl)-biphenyl-2-ol | C...)
Affinity DataKi:  320nM. Assay description: Displacement of [3H]CP55940 from cloned human CB1 receptor
In DepthDetails ArticlePubMed
TargetCannabinoid receptor 2(Homo sapiens (Human))
Adolor
Curated by ChEMBL
LigandPNGBDBM50213140(4'-amino-4-(1,1-dimethyl-heptyl)-biphenyl-2-ol | C...)
Affinity DataKi:  1.00E+3nM. Assay description: Displacement of [3H]CP55940 from cloned human CB2 receptor
In DepthDetails ArticlePubMed