BDBM50213279 CHEMBL345415
SMILES C\C(=C\CO\N=C1\CN2CCC1C2)C#Cc1ccccc1
InChI Key InChIKey=FYVBKGRFGASYCS-QNNPSDNZSA-N
Data  2 IC50
  Tab Delimited (TSV)   2D SDfile   Computed 3D by Vconf -m prep SDfile
Find this compound or compounds like it in BindingDB:
Activity Spreadsheet -- Enzyme Inhibition Constant Data from BindingDB
Found 2 hits for monomerid = 50213279
LigandPNGBDBM50213279(CHEMBL345415)
Affinity DataIC50:  181nM. Assay description: Binding affinity against muscarinic receptor using radioligand [3H]quinuclidinyl benzilate (QNB) binding assay in membrane preparations of rat neocor...
In DepthDetails
LigandPNGBDBM50213279(CHEMBL345415)
Affinity DataIC50:  1.10nM. Assay description: Binding affinity against muscarinic receptor using radioligand [3H]cis-methyldioxolane (CMD) binding assay in membrane preparations of rat neocortex.
In DepthDetails