BDBM50213693 (3S,5S,8R,9S,10S,13R,14R,17R)-5,13-dimethyl-17-((R)-6-methylheptan-2-yl)-14-(oxiran-2-ylmethyl)-hexadecahydro-1H-cyclopenta[a]phenanthrene-3,10-diol::CHEMBL398686
SMILES CC(C)CCC[C@@H](C)[C@H]1CC[C@@]2(CC3CO3)[C@@H]3CC[C@@]4(C)C[C@@H](O)CC[C@]4(O)[C@H]3CC[C@]12C
InChI Key InChIKey=FYBXFTKMXVTULJ-GURYXTELSA-N
Data  1 KI
  Tab Delimited (TSV)   2D SDfile   Computed 3D by Vconf -m prep SDfile
Find this compound or compounds like it in BindingDB:
Activity Spreadsheet -- Enzyme Inhibition Constant Data from BindingDB
Found 1 hit for monomerid = 50213693
TargetLanosterol 14-alpha demethylase(Rattus norvegicus)
Sinhgad College Of Pharmacy
Curated by ChEMBL
LigandPNGBDBM50213693((3S,5S,8R,9S,10S,13R,14R,17R)-5,13-dimethyl-17-((R...)
Affinity DataKi:  600nM. Assay description: Inhibition of rat liver LDM
In DepthDetails ArticlePubMed