BDBM50215434 CHEMBL243539::N-(2-(1H-imidazol-5-yl)ethyl)-2-(6-(3-aminophenyl)-5-chloro-3-(cyclobutylamino)-2-oxopyrazin-1(2H)-yl)acetamide
SMILES Nc1cccc(c1)-c1c(Cl)nc(NC2CCC2)c(=O)n1CC(=O)NCCc1cnc[nH]1
InChI Key InChIKey=SMXFXFXTOWXPSC-UHFFFAOYSA-N
Data  3 IC50
  Tab Delimited (TSV)   2D SDfile   Computed 3D by Vconf -m prep SDfile
Find this compound or compounds like it in BindingDB:
Activity Spreadsheet -- Enzyme Inhibition Constant Data from BindingDB
Found 3 hits for monomerid = 50215434
TargetCoagulation factor VII(Homo sapiens (Human))
Pfizer
Curated by ChEMBL
LigandPNGBDBM50215434(CHEMBL243539 | N-(2-(1H-imidazol-5-yl)ethyl)-2-(6-...)
Affinity DataIC50: >3.00E+4nM. Assay description: Inhibition of factor 7a
In DepthDetails ArticlePubMed
TargetCoagulation factor X(Homo sapiens (Human))
Pfizer
Curated by ChEMBL
LigandPNGBDBM50215434(CHEMBL243539 | N-(2-(1H-imidazol-5-yl)ethyl)-2-(6-...)
Affinity DataIC50: >3.00E+4nM. Assay description: Inhibition of factor 10a
In DepthDetails ArticlePubMed
TargetProthrombin(Homo sapiens (Human))
Pfizer
Curated by ChEMBL
LigandPNGBDBM50215434(CHEMBL243539 | N-(2-(1H-imidazol-5-yl)ethyl)-2-(6-...)
Affinity DataIC50: >3.00E+4nM. Assay description: Inhibition of factor 2a
In DepthDetails ArticlePubMed