BDBM50215532 CHEMBL41202
SMILES COc1ccccc1N1CCN(CCCOc2ccc(cc2OCc2ccccc2)C(=O)Nc2ccccc2OCCCC(O)=O)CC1
InChI Key InChIKey=LFOMPXLJSNZKDY-UHFFFAOYSA-N
Data  1 IC50
  Tab Delimited (TSV)   2D SDfile   Computed 3D by Vconf -m prep SDfile
Find this compound or compounds like it in BindingDB:
Activity Spreadsheet -- Enzyme Inhibition Constant Data from BindingDB
Found 1 hit for monomerid = 50215532
Target3-oxo-5-alpha-steroid 4-dehydrogenase 1/2(Rattus norvegicus)
Zeria Pharmaceutical
Curated by ChEMBL
LigandPNGBDBM50215532(CHEMBL41202)
Affinity DataIC50:  3.50E+3nM. Assay description: Inhibition of Steroid 5-alpha-reductase from Dawley rat prostate
In DepthDetails ArticlePubMed