BDBM50216299 CHEMBL315529
SMILES COc1ccc(cc1OC1CCCC1)C(CC#N)N1C(=O)c2ccccc2C1=O
InChI Key InChIKey=KDJPYXRZCZGQSU-UHFFFAOYSA-N
Data  1 IC50
  Tab Delimited (TSV)   2D SDfile   Computed 3D by Vconf -m prep SDfile
Find this compound or compounds like it in BindingDB:
Activity Spreadsheet -- Enzyme Inhibition Constant Data from BindingDB
Found 1 hit for monomerid = 50216299
TargetcAMP-specific 3',5'-cyclic phosphodiesterase 4A/4B/4C/4D(Homo sapiens (Human))
Celgene
Curated by ChEMBL
LigandPNGBDBM50216299(CHEMBL315529)
Affinity DataIC50:  350nM. Assay description: Inhibition of PDE4 enzyme from U937 cells
In DepthDetails ArticlePubMed