BDBM50216305 CHEMBL275009
SMILES COC(=O)CC(N1C(=O)c2c(C1=O)c(F)c(F)c(F)c2F)c1ccc(OC)c(OC)c1
InChI Key InChIKey=AQCHRLTWCAURNI-UHFFFAOYSA-N
Data  1 IC50
  Tab Delimited (TSV)   2D SDfile   Computed 3D by Vconf -m prep SDfile
Find this compound or compounds like it in BindingDB:
Activity Spreadsheet -- Enzyme Inhibition Constant Data from BindingDB
Found 1 hit for monomerid = 50216305
TargetcAMP-specific 3',5'-cyclic phosphodiesterase 4A/4B/4C/4D(Homo sapiens (Human))
Celgene
Curated by ChEMBL
LigandPNGBDBM50216305(CHEMBL275009)
Affinity DataIC50:  4.70E+3nM. Assay description: Inhibition of phosphodiesterase 4 from U937 cells
In DepthDetails ArticlePubMed