BDBM50216325 CHEMBL341814
SMILES CCCc1cccc(\C=C\c2cccc(c2)[C@@H](CCc2ccccc2C(C)(C)O)SCC2(CC(O)=O)CC2)n1
InChI Key InChIKey=XWWWRDGIDIASEO-IQPSODPJSA-N
Data  1 IC50
  Tab Delimited (TSV)   2D SDfile   Computed 3D by Vconf -m prep SDfile
Find this compound or compounds like it in BindingDB:
Activity Spreadsheet -- Enzyme Inhibition Constant Data from BindingDB
Found 1 hit for monomerid = 50216325
TargetCysteinyl leukotriene receptor 1/2(Homo sapiens (Human))
Merck Frosst Center For Therapeutic Research
Curated by ChEMBL
LigandPNGBDBM50216325(CHEMBL341814)
Affinity DataIC50:  1.20nM. Assay description: In vitro inhibition of [3H]-LTD4 binding to LTD4 receptor of guinea pig lung membrane without human serum albumin (HSA).
In DepthDetails ArticlePubMed