BDBM50216468 (3R,4S,5S,6R)-6-(hydroxymethyl)-3-(undec-10-enyloxy)-tetrahydro-2H-pyran-2,4,5-triol::CHEMBL249474
SMILES OC[C@H]1OC(O)[C@H](OCCCCCCCCCC=C)[C@@H](O)[C@@H]1O
InChI Key InChIKey=CBARNIRAYRURSB-VDWCLKJHSA-N
Data  1 KI
  Tab Delimited (TSV)   2D SDfile   Computed 3D by Vconf -m prep SDfile
Find this compound or compounds like it in BindingDB:
Activity Spreadsheet -- Enzyme Inhibition Constant Data from BindingDB
Found 1 hit for monomerid = 50216468
TargetPutative sugar transporter(Plasmodium falciparum)
Université
Curated by ChEMBL
LigandPNGBDBM50216468((3R,4S,5S,6R)-6-(hydroxymethyl)-3-(undec-10-enylox...)
Affinity DataKi:  2.00E+3nM. Assay description: Inhibition of [3H]glucose uptake at Plasmodium falciparum HT expressed in Xenopus laevis oocytes
In DepthDetails ArticlePubMed