BDBM50216471 (2R,3S,4S,5R,6S)-2-(hydroxymethyl)-6-(undec-10-enyloxy)-tetrahydro-2H-pyran-3,4,5-triol::CHEMBL250943
SMILES OC[C@H]1O[C@H](OCCCCCCCCCC=C)[C@H](O)[C@@H](O)[C@@H]1O
InChI Key InChIKey=JVPZFKPXWHKTKZ-UUAJXVIYSA-N
Data  1 KI
  Tab Delimited (TSV)   2D SDfile   Computed 3D by Vconf -m prep SDfile
Find this compound or compounds like it in BindingDB:
Activity Spreadsheet -- Enzyme Inhibition Constant Data from BindingDB
Found 1 hit for monomerid = 50216471
TargetPutative sugar transporter(Plasmodium falciparum)
Université
Curated by ChEMBL
LigandPNGBDBM50216471((2R,3S,4S,5R,6S)-2-(hydroxymethyl)-6-(undec-10-eny...)
Affinity DataKi: >5.00E+5nM. Assay description: Inhibition of [3H]glucose uptake at Plasmodium falciparum HT expressed in Xenopus laevis oocytes
In DepthDetails ArticlePubMed