BDBM50216672 CHEMBL248196::tert-butyl (R)-3-(2,6-difluorophenyl)-1-((R)-1-isopropyl-2-oxo-2,3,4,5-tetrahydro-1H-benzo[b]azepin-3-ylamino)-1-oxopropan-2-ylcarbamate
SMILES CC(C)N1c2ccccc2CC[C@@H](NC(=O)[C@@H](Cc2c(F)cccc2F)NC(=O)OC(C)(C)C)C1=O
InChI Key InChIKey=YALMTJOCIGQSJL-FGZHOGPDSA-N
Data  1 IC50
  Tab Delimited (TSV)   2D SDfile   Computed 3D by Vconf -m prep SDfile
Find this compound or compounds like it in BindingDB:
Activity Spreadsheet -- Enzyme Inhibition Constant Data from BindingDB
Found 1 hit for monomerid = 50216672
TargetSodium channel protein type 9 subunit alpha(Homo sapiens (Human))
Merck Research Laboratories
Curated by ChEMBL
LigandPNGBDBM50216672(CHEMBL248196 | tert-butyl (R)-3-(2,6-difluoropheny...)
Affinity DataIC50:  14nM. Assay description: Blockade of human Nav1.7 by FRET assay
In DepthDetails ArticlePubMed