BDBM50216787 1,7-diaminoheptane::CHEMBL28242::Heptane-1,7-diamine
SMILES NCCCCCCCN
InChI Key InChIKey=PWSKHLMYTZNYKO-UHFFFAOYSA-N
Data  1 KI
  Tab Delimited (TSV)   2D SDfile   Computed 3D by Vconf -m prep SDfile
Find this compound or compounds like it in BindingDB:
Activity Spreadsheet -- Enzyme Inhibition Constant Data from BindingDB
Found 1 hit for monomerid = 50216787
TargetDeoxyhypusine synthase(Plasmodium falciparum)
Institute For Medical Parasitology
Curated by ChEMBL
LigandPNGBDBM50216787(1,7-diaminoheptane | CHEMBL28242 | Heptane-1,7-dia...)
Affinity DataKi:  5.00E+4nM. Assay description: Inhibition of recombinant deoxyhypusine synthase in Plasmodium falciparum NF54
In DepthDetails ArticlePubMed