BDBM50217590 (5-(4-(4-cyclopropylpiperazin-1-yl)butyl)-2-(4-(methylthio)phenoxy)phenyl)-N-methylmethanamine::CHEMBL238143
SMILES CNCc1cc(CCCCN2CCN(CC2)C2CC2)ccc1Oc1ccc(SC)cc1
InChI Key InChIKey=KSRMXPIAWHFMID-UHFFFAOYSA-N
Data  3 KI
  Tab Delimited (TSV)   2D SDfile   Computed 3D by Vconf -m prep SDfile
Find this compound or compounds like it in BindingDB:
Activity Spreadsheet -- Enzyme Inhibition Constant Data from BindingDB
Found 3 hits for monomerid = 50217590
TargetSodium-dependent serotonin transporter(Rattus norvegicus (rat))
Johnson & Johnson Pharmaceutical Research & Development
Curated by ChEMBL
LigandPNGBDBM50217590((5-(4-(4-cyclopropylpiperazin-1-yl)butyl)-2-(4-(me...)
Affinity DataKi:  0.600nM. Assay description: Binding affinity to rat SERT
In DepthDetails ArticlePubMed
TargetSodium-dependent serotonin transporter(Homo sapiens (Human))
Johnson & Johnson Pharmaceutical Research & Development
Curated by ChEMBL
LigandPNGBDBM50217590((5-(4-(4-cyclopropylpiperazin-1-yl)butyl)-2-(4-(me...)
Affinity DataKi:  2nM. Assay description: Binding affinity to human SERT
In DepthDetails ArticlePubMed
TargetHistamine H3 receptor(Homo sapiens (Human))
Johnson & Johnson Pharmaceutical Research & Development
Curated by ChEMBL
LigandPNGBDBM50217590((5-(4-(4-cyclopropylpiperazin-1-yl)butyl)-2-(4-(me...)
Affinity DataKi:  4.70nM. Assay description: Binding affinity to human histamine H3 receptor
In DepthDetails ArticlePubMed