BDBM50217592 (5-(4-(4-isopropylpiperazin-1-yl)but-1-ynyl)-2-(4-(methylthio)phenoxy)phenyl)-N-methylmethanamine::CHEMBL441137
SMILES CNCc1cc(ccc1Oc1ccc(SC)cc1)C#CCCN1CCN(CC1)C(C)C
InChI Key InChIKey=BJWZNXSSJMLUNB-UHFFFAOYSA-N
Data  3 KI
  Tab Delimited (TSV)   2D SDfile   Computed 3D by Vconf -m prep SDfile
Find this compound or compounds like it in BindingDB:
Activity Spreadsheet -- Enzyme Inhibition Constant Data from BindingDB
Found 3 hits for monomerid = 50217592
TargetSodium-dependent serotonin transporter(Rattus norvegicus (rat))
Johnson & Johnson Pharmaceutical Research & Development
Curated by ChEMBL
LigandPNGBDBM50217592((5-(4-(4-isopropylpiperazin-1-yl)but-1-ynyl)-2-(4-...)
Affinity DataKi:  0.5nM. Assay description: Binding affinity to rat SERT
In DepthDetails ArticlePubMed
TargetSodium-dependent serotonin transporter(Homo sapiens (Human))
Johnson & Johnson Pharmaceutical Research & Development
Curated by ChEMBL
LigandPNGBDBM50217592((5-(4-(4-isopropylpiperazin-1-yl)but-1-ynyl)-2-(4-...)
Affinity DataKi:  13nM. Assay description: Binding affinity to human SERT
In DepthDetails ArticlePubMed
TargetHistamine H3 receptor(Homo sapiens (Human))
Johnson & Johnson Pharmaceutical Research & Development
Curated by ChEMBL
LigandPNGBDBM50217592((5-(4-(4-isopropylpiperazin-1-yl)but-1-ynyl)-2-(4-...)
Affinity DataKi:  31nM. Assay description: Binding affinity to human histamine H3 receptor
In DepthDetails ArticlePubMed