BDBM50217824 BMS-363130::CHEMBL70738
SMILES [H][C@@]1(C[C@@H]2[C@H](N(C(=O)N3CCN(CC3)C(=O)CCCCCc3ccccc3)C2=O)C(O)=O)CCCN(C1)C(N)=N
InChI Key InChIKey=FHCQLMSOTXBNCN-ZDXQCDESSA-N
Data  2 IC50
  Tab Delimited (TSV)   2D SDfile   Computed 3D by Vconf -m prep SDfile
Find this compound or compounds like it in BindingDB:
Activity Spreadsheet -- Enzyme Inhibition Constant Data from BindingDB
Found 2 hits for monomerid = 50217824
TargetTryptase delta(Homo sapiens (Human))
The Bristol-Myers Squibb Pharmaceutical Research Institute
Curated by ChEMBL
LigandPNGBDBM50217824(BMS-363130 | CHEMBL70738)
Affinity DataIC50: <1.70nM. Assay description: Inhibitory concentration against human tryptase
In DepthDetails ArticlePubMed
TargetTryptase beta-2/delta/gamma(Homo sapiens (Human))
The Bristol-Myers Squibb Pharmaceutical Research Institute
Curated by ChEMBL
LigandPNGBDBM50217824(BMS-363130 | CHEMBL70738)
Affinity DataIC50: <1.70nM. Assay description: Inhibitory activity of compound against human tryptase was determined
In DepthDetails ArticlePubMed