BDBM50219525 CHEMBL287042
SMILES CS(=O)(=O)N1CCC[C@H]1Cn1ccc2cc(ccc12)C(=O)N1CCC(CC1)N1C(=O)OCc2ccccc12
InChI Key InChIKey=UXWBJGNKNTZXMY-DEOSSOPVSA-N
Data  1 KI
  Tab Delimited (TSV)   2D SDfile   Computed 3D by Vconf -m prep SDfile
Find this compound or compounds like it in BindingDB:
Activity Spreadsheet -- Enzyme Inhibition Constant Data from BindingDB
Found 1 hit for monomerid = 50219525
TargetOxytocin receptor(Homo sapiens (Human))
Glaxosmithkline
Curated by ChEMBL
LigandPNGBDBM50219525(CHEMBL287042)
Affinity DataKi:  126nM. Assay description: Compound was tested for its ability to displace [3H]oxytocin from human Oxytocin receptor
In DepthDetails ArticlePubMed