BDBM50219526 CHEMBL279782
SMILES CN1CCC(=O)N(CC(=O)NCc2cc3cc(ccc3o2)C(=O)N2CCC(CC2)N2C(=O)OCc3ccccc23)C1=O
InChI Key InChIKey=PNHWVHVANRGXBE-UHFFFAOYSA-N
Data  1 KI
  Tab Delimited (TSV)   2D SDfile   Computed 3D by Vconf -m prep SDfile
Find this compound or compounds like it in BindingDB:
Activity Spreadsheet -- Enzyme Inhibition Constant Data from BindingDB
Found 1 hit for monomerid = 50219526
TargetOxytocin receptor(Homo sapiens (Human))
Glaxosmithkline
Curated by ChEMBL
LigandPNGBDBM50219526(CHEMBL279782)
Affinity DataKi:  4nM. Assay description: Ability to displace [3H]oxytocin from human OT receptor (hOT)
In DepthDetails ArticlePubMed