BDBM50220487 CHEMBL26347
SMILES CCCC(C)n1c(CC)nc2c(nccc12)-c1ccc(cc1Cl)C(F)(F)F
InChI Key InChIKey=CEXYUPVEQPPUHE-UHFFFAOYSA-N
Data  1 KI
  Tab Delimited (TSV)   2D SDfile   Computed 3D by Vconf -m prep SDfile
Find this compound or compounds like it in BindingDB:
Activity Spreadsheet -- Enzyme Inhibition Constant Data from BindingDB
Found 1 hit for monomerid = 50220487
TargetCorticotropin-releasing factor receptor 1/2(Rattus norvegicus (rat))
Bristol-Myers Squibb
Curated by ChEMBL
LigandPNGBDBM50220487(CHEMBL26347)
Affinity DataKi:  3.5nM. Assay description: In vitro binding affinity against Corticotropin releasing factor receptor in rat cortical homogenates
In DepthDetails ArticlePubMed