BDBM50220699 (R)-N-((S)-1-(4-(tert-butylcarbamoyl)-4-(4-methylcyclohexyl)piperidin-1-yl)-3-(4-fluorophenyl)-1-oxopropan-2-yl)-4-methylpiperazine-2-carboxamide::CHEMBL249321
SMILES CC1CCC(CC1)C1(CCN(CC1)C(=O)[C@H](Cc1ccc(F)cc1)NC(=O)[C@H]1CN(C)CCN1)C(=O)NC(C)(C)C
InChI Key InChIKey=OHUUAUIQJKMPAV-RICNADKYSA-N
Data  1 IC50  3 EC50
  Tab Delimited (TSV)   2D SDfile   Computed 3D by Vconf -m prep SDfile
Find this compound or compounds like it in BindingDB:
Activity Spreadsheet -- Enzyme Inhibition Constant Data from BindingDB
Found 4 hits for monomerid = 50220699
TargetMelanocortin receptor 3(Homo sapiens (Human))
Merck
Curated by ChEMBL
LigandPNGBDBM50220699((R)-N-((S)-1-(4-(tert-butylcarbamoyl)-4-(4-methylc...)
Affinity DataEC50:  230nM. Assay description: Antagonist activity at human MC3R assessed as stimulation of cAMP production
In DepthDetails ArticlePubMed
TargetMelanocortin receptor 4(Homo sapiens (Human))
Merck
Curated by ChEMBL
LigandPNGBDBM50220699((R)-N-((S)-1-(4-(tert-butylcarbamoyl)-4-(4-methylc...)
Affinity DataIC50:  6.80nM. Assay description: Binding affinity to human MC4R
In DepthDetails ArticlePubMed
TargetMelanocortin receptor 5(Homo sapiens (Human))
Merck
Curated by ChEMBL
LigandPNGBDBM50220699((R)-N-((S)-1-(4-(tert-butylcarbamoyl)-4-(4-methylc...)
Affinity DataEC50:  888nM. Assay description: Antagonist activity at human MC5R assessed as stimulation of cAMP production
In DepthDetails ArticlePubMed
TargetMelanocortin receptor 4(Homo sapiens (Human))
Merck
Curated by ChEMBL
LigandPNGBDBM50220699((R)-N-((S)-1-(4-(tert-butylcarbamoyl)-4-(4-methylc...)
Affinity DataEC50:  10nM. Assay description: Antagonist activity at human MC4R assessed as stimulation of cAMP production
In DepthDetails ArticlePubMed