BDBM50220711 (R)-N-((S)-3-(4-chlorophenyl)-1-(4-(cyanomethyl)-4-cyclopentylpiperidin-1-yl)-1-oxopropan-2-yl)-1,2,3,4-tetrahydroisoquinoline-3-carboxamide::CHEMBL248893
SMILES Clc1ccc(C[C@H](NC(=O)[C@H]2Cc3ccccc3CN2)C(=O)N2CCC(CC#N)(CC2)C2CCCC2)cc1
InChI Key InChIKey=INUXQJJHMOGPLU-IZLXSDGUSA-N
Data  1 IC50  2 EC50
  Tab Delimited (TSV)   2D SDfile   Computed 3D by Vconf -m prep SDfile
Find this compound or compounds like it in BindingDB:
Activity Spreadsheet -- Enzyme Inhibition Constant Data from BindingDB
Found 3 hits for monomerid = 50220711
TargetMelanocortin receptor 4(Homo sapiens (Human))
Merck
Curated by ChEMBL
LigandPNGBDBM50220711((R)-N-((S)-3-(4-chlorophenyl)-1-(4-(cyanomethyl)-4...)
Affinity DataEC50:  196nM. Assay description: Antagonist activity at human MC4R assessed as stimulation of cAMP production
In DepthDetails ArticlePubMed
TargetMelanocortin receptor 5(Homo sapiens (Human))
Merck
Curated by ChEMBL
LigandPNGBDBM50220711((R)-N-((S)-3-(4-chlorophenyl)-1-(4-(cyanomethyl)-4...)
Affinity DataEC50:  630nM. Assay description: Antagonist activity at human MC5R assessed as stimulation of cAMP production
In DepthDetails ArticlePubMed
TargetMelanocortin receptor 4(Homo sapiens (Human))
Merck
Curated by ChEMBL
LigandPNGBDBM50220711((R)-N-((S)-3-(4-chlorophenyl)-1-(4-(cyanomethyl)-4...)
Affinity DataIC50:  16nM. Assay description: Binding affinity to human MC4R
In DepthDetails ArticlePubMed