BDBM50220737 CHEMBL308109
SMILES CC(C)(C)CNC(=O)N1CCN(CC1)C(=O)N1[C@@H]([C@@H](CC2CCNCC2)C1=O)C(O)=O
InChI Key InChIKey=FJVMDHPIUBGZNK-CVEARBPZSA-N
Data  1 IC50
  Tab Delimited (TSV)   2D SDfile   Computed 3D by Vconf -m prep SDfile
Find this compound or compounds like it in BindingDB:
Activity Spreadsheet -- Enzyme Inhibition Constant Data from BindingDB
Found 1 hit for monomerid = 50220737
TargetTryptase beta-2/delta/gamma(Homo sapiens (Human))
The Bristol-Myers Squibb Pharmaceutical Research Institute
Curated by ChEMBL
LigandPNGBDBM50220737(CHEMBL308109)
Affinity DataIC50:  30nM. Assay description: Inhibitory activity of compound against human tryptase was determined
In DepthDetails ArticlePubMed