BDBM50221465 CHEMBL95821
SMILES [H][C@@]1(O[C@H]([C@H](O)[C@@H]1OC)n1ccc(=O)[nH]c1=O)[C@@H](O[C@H]1OC(=C[C@H](O)[C@@H]1O)C(=O)NCC(c1ccccc1)c1ccccc1)C(N)=O
InChI Key InChIKey=WEJMHXHNNKZSFR-LTRPPTTCSA-N
Data  1 IC50
  Tab Delimited (TSV)   2D SDfile   Computed 3D by Vconf -m prep SDfile
Find this compound or compounds like it in BindingDB:
Activity Spreadsheet -- Enzyme Inhibition Constant Data from BindingDB
Found 1 hit for monomerid = 50221465
TargetPhospho-N-acetylmuramoyl-pentapeptide-transferase(Escherichia coli (strain K12))
Sankyo
Curated by ChEMBL
LigandPNGBDBM50221465(CHEMBL95821)
Affinity DataIC50:  203nM. Assay description: Inhibitory activity against translocase I
In DepthDetails ArticlePubMed