BDBM50221469 CHEMBL329448
SMILES [H][C@@]1(O[C@H]([C@H](O)[C@@H]1OC)n1ccc(=O)[nH]c1=O)[C@@H](O[C@H]1OC(=C[C@H](O)[C@@H]1O)C(=O)Nc1ccc(F)cc1F)C(N)=O
InChI Key InChIKey=WVUHNAQXSCYZAG-KQSVRIFWSA-N
Data  1 IC50
  Tab Delimited (TSV)   2D SDfile   Computed 3D by Vconf -m prep SDfile
Find this compound or compounds like it in BindingDB:
Activity Spreadsheet -- Enzyme Inhibition Constant Data from BindingDB
Found 1 hit for monomerid = 50221469
TargetPhospho-N-acetylmuramoyl-pentapeptide-transferase(Escherichia coli (strain K12))
Sankyo
Curated by ChEMBL
LigandPNGBDBM50221469(CHEMBL329448)
Affinity DataIC50:  26.3nM. Assay description: Inhibitory activity against translocase I
In DepthDetails ArticlePubMed